{"text_format":"3","workbook":"xlsx","n_sheets":3,"sheets":["Tool","Summary","Handout"],"not_rendered":{"charts":3,"images":1,"external_links":1,"defined_names":11},"read":"whole","date_system":"1900"}

{"sheet":"Tool","index":0,"n_rows":215,"n_cols":24,"rows_kept":215,"merged":[[3,8,3,9],[3,12,3,13],[3,16,3,17],[5,4,5,5]]}
[null,{"$f":"[0]!Title_Model","v":"RAE: ALLOWED REVENUE MODEL"}]
[null,{"$f":"Title_Project","v":{"$error":"#REF!"}}]
[]
[{"$nulls":7},{"$f":"IF(H11<>\"\",H10&\": \"&H11,\"\")","v":"1: Project A"},{"$f":"J164","v":""},null,null,{"$f":"IF(L11<>\"\",L10&\": \"&L11,\"\")","v":"2: Project B"},{"$f":"N164","v":""},null,null,{"$f":"IF(P11<>\"\",P10&\": \"&P11,\"\")","v":"3: Project C"},{"$f":"R164","v":""},null,null,"Annex: Answer options"]
[]
[null,null,"Question",null,"Overall importance {weight}",null,null,"Answer","Score \n(1-5)","Weighted score",null,"Answer","Score \n(1-5)","Weighted score",null,"Answer","Score \n(1-5)","Weighted score",null,1,2,3,4,5]
[]
[null,null,"Project details"]
[]
[null,null,"No.",{"$nulls":4},{"$f":"IF(H11<>\"\",MAX(G10:$G10)+1,\"\")","v":1},{"$nulls":3},{"$f":"IF(L11<>\"\",MAX($G10:K10)+1,\"\")","v":2},{"$nulls":3},{"$f":"IF(P11<>\"\",MAX($G10:O10)+1,\"\")","v":3}]
[null,null,"Title",{"$nulls":4},"Project A",{"$nulls":3},"Project B",{"$nulls":3},"Project C"]
[null,null,"Description",{"$nulls":4},"Sector etc."]
[]
[null,"A","How supportive is the PPP environment?"]
[]
[null,"I","Public sector capacity and experience"]
[]
[null,{"$f":"IF(C18<>\"\",MAX(B$14:B17)+1,\"\")","v":1},"Does the sponsoring entity have the capabilities to procure PPPs?",null,"High",{"$f":" IFERROR(INDEX($F$202:$F$205,MATCH($E18,$C$202:$C$205,0),1),0)","v":{"v":0.75,"d":"{75%}"}},null,null,{"$f":"INDEX($T$6:$X$6,1,MATCH(H18,$T18:$X18,0))","v":{"$error":"#N/A"}},{"$f":"I18*INDEX($F$202:$F$205,MATCH($E18,$C$202:$C$205,0),1)","v":{"$error":"#N/A"}},null,null,{"$f":"INDEX($T$6:$X$6,1,MATCH(L18,$T18:$X18,0))","v":{"$error":"#N/A"}},{"$f":"M18*INDEX($F$202:$F$205,MATCH($E18,$C$202:$C$205,0),1)","v":{"$error":"#N/A"}},null,null,{"$f":"INDEX($T$6:$X$6,1,MATCH(P18,$T18:$X18,0))","v":{"$error":"#N/A"}},{"$f":"Q18*INDEX($F$202:$F$205,MATCH($E18,$C$202:$C$205,0),1)","v":{"$error":"#N/A"}},null,"No capabilities","Very little capability","Some capabilities","Good capability","Full set of capabilities"]
[]
[null,{"$f":"IF(C20<>\"\",MAX(B$14:B19)+1,\"\")","v":2},"Does the sponsoring entity have the capabilities to manage and monitor a PPP contract?",null,"High",{"$f":" IFERROR(INDEX($F$202:$F$205,MATCH($E20,$C$202:$C$205,0),1),0)","v":{"v":0.75,"d":"{75%}"}},null,null,{"$f":"INDEX($T$6:$X$6,1,MATCH(H20,$T20:$X20,0))","v":{"$error":"#N/A"}},{"$f":"I20*INDEX($F$202:$F$205,MATCH($E20,$C$202:$C$205,0),1)","v":{"$error":"#N/A"}},null,null,{"$f":"INDEX($T$6:$X$6,1,MATCH(L20,$T20:$X20,0))","v":{"$error":"#N/A"}},{"$f":"M20*INDEX($F$202:$F$205,MATCH($E20,$C$202:$C$205,0),1)","v":{"$error":"#N/A"}},null,null,{"$f":"INDEX($T$6:$X$6,1,MATCH(P20,$T20:$X20,0))","v":{"$error":"#N/A"}},{"$f":"Q20*INDEX($F$202:$F$205,MATCH($E20,$C$202:$C$205,0),1)","v":{"$error":"#N/A"}},null,"No capabilities","Very little capability","Some capabilities","Good capability","Full set of capabilities"]
{"$rows_left_out":168}
{"sheet":"Summary","index":1,"n_rows":79,"n_cols":6,"rows_kept":79,"merged":[[4,2,5,2],[4,3,4,5],[65,2,66,2],[65,3,66,3]]}
[null,{"$f":"[0]!Title_Model","v":"RAE: ALLOWED REVENUE MODEL"}]
[null,{"$f":"Title_Project","v":{"$error":"#REF!"}}]
[]
[]
[null,null,"Category","Score"]
[{"$nulls":3},{"$f":"IF(Tool!H11<>\"\",Tool!H11,\"\")","v":"Project A"},{"$f":"IF(Tool!L11<>\"\",Tool!L11,\"\")","v":"Project B"},{"$f":"IF(Tool!P11<>\"\",Tool!P11,\"\")","v":"Project C"}]
[null,null,{"$f":"Tool!C150","v":"Public sector capacity and experience"},{"$f":"Tool!J150","v":{"$error":"#N/A"}},{"$f":"IFERROR(Tool!N150,\"\")","v":""},{"$f":"IFERROR(Tool!R150,\"\")","v":""}]
[null,null,{"$f":"Tool!C151","v":"Public sector funding"},{"$f":"Tool!J151","v":{"$error":"#N/A"}},{"$f":"IFERROR(Tool!N151,\"\")","v":""},{"$f":"IFERROR(Tool!R151,\"\")","v":""}]
[null,null,{"$f":"Tool!C152","v":"Private sector capability and appetite"},{"$f":"Tool!J152","v":{"$error":"#N/A"}},{"$f":"IFERROR(Tool!N152,\"\")","v":""},{"$f":"IFERROR(Tool!R152,\"\")","v":""}]
[null,null,{"$f":"Tool!C153","v":"Key project characteristics"},{"$f":"Tool!J153","v":{"$error":"#N/A"}},{"$f":"IFERROR(Tool!N153,\"\")","v":""},{"$f":"IFERROR(Tool!R153,\"\")","v":""}]
[null,null,{"$f":"Tool!C154","v":"Fit with development priorities"},{"$f":"Tool!J154","v":{"$error":"#N/A"}},{"$f":"IFERROR(Tool!N154,\"\")","v":""},{"$f":"IFERROR(Tool!R154,\"\")","v":""}]
[null,null,{"$f":"Tool!C155","v":"Land acquisition"},{"$f":"Tool!J155","v":{"$error":"#N/A"}},{"$f":"IFERROR(Tool!N155,\"\")","v":""},{"$f":"IFERROR(Tool!R155,\"\")","v":""}]
[null,null,{"$f":"Tool!C156","v":"Environmental and social impacts"},{"$f":"Tool!J156","v":{"$error":"#N/A"}},{"$f":"IFERROR(Tool!N156,\"\")","v":""},{"$f":"IFERROR(Tool!R156,\"\")","v":""}]
[null,null,{"$f":"Tool!C157","v":"Labour and employment"},{"$f":"Tool!J157","v":{"$error":"#N/A"}},{"$f":"IFERROR(Tool!N157,\"\")","v":""},{"$f":"IFERROR(Tool!R157,\"\")","v":""}]
[null,null,{"$f":"Tool!C158","v":"Demand and payment risk"},{"$f":"Tool!J158","v":{"$error":"#N/A"}},{"$f":"IFERROR(Tool!N158,\"\")","v":""},{"$f":"IFERROR(Tool!R158,\"\")","v":""}]
[null,null,{"$f":"Tool!C159","v":"Commercial viability"},{"$f":"Tool!J159","v":{"$error":"#N/A"}},{"$f":"IFERROR(Tool!N159,\"\")","v":""},{"$f":"IFERROR(Tool!R159,\"\")","v":""}]
[null,null,{"$f":"Tool!C160","v":"Level of project preparation"},{"$f":"Tool!J160","v":{"$error":"#N/A"}},{"$f":"IFERROR(Tool!N160,\"\")","v":""},{"$f":"IFERROR(Tool!R160,\"\")","v":""}]
[null,null,{"$f":"Tool!C161","v":"Total"},{"$f":"Tool!J161","v":{"$error":"#N/A"}},{"$f":"IFERROR(Tool!N161,\"\")","v":""},{"$f":"IFERROR(Tool!R161,\"\")","v":""}]
[null,null,{"$f":"Tool!C163","v":"Final score (as % of max)"},{"$f":"Tool!J163","v":""},{"$f":"Tool!N163","v":""},{"$f":"Tool!R163","v":""}]
[null,null,{"$f":"Tool!C164","v":"Suitability for PPP"},{"$f":"Tool!J164","v":""},{"$f":"Tool!N164","v":""},{"$f":"Tool!R164","v":""}]
{"$rows_left_out":16}
{"sheet":"Handout","index":2,"n_rows":70,"n_cols":12,"rows_kept":70,"merged":[[3,1,4,1],[3,2,4,2],[3,4,3,8],[3,9,3,11],[61,2,61,10],[62,2,62,10],[63,2,63,10],[64,2,64,10],[65,2,65,8],[66,2,66,8],[67,2,67,8],[68,2,68,8],[69,2,69,8]]}
[null,{"$f":"[0]!Title_Model","v":"RAE: ALLOWED REVENUE MODEL"}]
[null,{"$f":"Title_Project","v":{"$error":"#REF!"}}]
[]
[null,"No.","Question",null,"Answers",{"$nulls":4},"Scoring"]
[{"$nulls":4},1,2,3,4,5,"Initial score \n(1 to 5)","Multiplied by weighting","Equals weighted score"]
[null,"A",{"$f":"INDEX(Tool!C$14:C$147,MATCH($B6,Tool!$B$14:$B$147,0),1)","v":"How supportive is the PPP environment?"},null,{"$f":"IF(INDEX(Tool!T$14:T$147,MATCH($B6,Tool!$B$14:$B$147,0),1)<>\"\",INDEX(Tool!T$14:T$147,MATCH($B6,Tool!$B$14:$B$147,0),1),\"\")","v":""},{"$f":"IF(INDEX(Tool!U$14:U$147,MATCH($B6,Tool!$B$14:$B$147,0),1)<>\"\",INDEX(Tool!U$14:U$147,MATCH($B6,Tool!$B$14:$B$147,0),1),\"\")","v":""},{"$f":"IF(INDEX(Tool!V$14:V$147,MATCH($B6,Tool!$B$14:$B$147,0),1)<>\"\",INDEX(Tool!V$14:V$147,MATCH($B6,Tool!$B$14:$B$147,0),1),\"\")","v":""},{"$f":"IF(INDEX(Tool!W$14:W$147,MATCH($B6,Tool!$B$14:$B$147,0),1)<>\"\",INDEX(Tool!W$14:W$147,MATCH($B6,Tool!$B$14:$B$147,0),1),\"\")","v":""},{"$f":"IF(INDEX(Tool!X$14:X$147,MATCH($B6,Tool!$B$14:$B$147,0),1)<>\"\",INDEX(Tool!X$14:X$147,MATCH($B6,Tool!$B$14:$B$147,0),1),\"\")","v":""},null,{"$f":"IF(INDEX(Tool!F$14:F$147,MATCH($B6,Tool!$B$14:$B$147,0),1)<>\"\",INDEX(Tool!F$14:F$147,MATCH($B6,Tool!$B$14:$B$147,0),1),\"\")","v":""},{"$f":"IF(J6<>\"\",K6*J6,\"\")","v":""}]
[null,"I",{"$f":"INDEX(Tool!C$14:C$147,MATCH($B7,Tool!$B$14:$B$147,0),1)","v":"Public sector capacity and experience"},null,{"$f":"IF(INDEX(Tool!T$14:T$147,MATCH($B7,Tool!$B$14:$B$147,0),1)<>\"\",INDEX(Tool!T$14:T$147,MATCH($B7,Tool!$B$14:$B$147,0),1),\"\")","v":""},{"$f":"IF(INDEX(Tool!U$14:U$147,MATCH($B7,Tool!$B$14:$B$147,0),1)<>\"\",INDEX(Tool!U$14:U$147,MATCH($B7,Tool!$B$14:$B$147,0),1),\"\")","v":""},{"$f":"IF(INDEX(Tool!V$14:V$147,MATCH($B7,Tool!$B$14:$B$147,0),1)<>\"\",INDEX(Tool!V$14:V$147,MATCH($B7,Tool!$B$14:$B$147,0),1),\"\")","v":""},{"$f":"IF(INDEX(Tool!W$14:W$147,MATCH($B7,Tool!$B$14:$B$147,0),1)<>\"\",INDEX(Tool!W$14:W$147,MATCH($B7,Tool!$B$14:$B$147,0),1),\"\")","v":""},{"$f":"IF(INDEX(Tool!X$14:X$147,MATCH($B7,Tool!$B$14:$B$147,0),1)<>\"\",INDEX(Tool!X$14:X$147,MATCH($B7,Tool!$B$14:$B$147,0),1),\"\")","v":""},null,{"$f":"IF(INDEX(Tool!F$14:F$147,MATCH($B7,Tool!$B$14:$B$147,0),1)<>\"\",INDEX(Tool!F$14:F$147,MATCH($B7,Tool!$B$14:$B$147,0),1),\"\")","v":""},""]
[null,{"$f":"MAX(B$6:B7)+1","v":1},{"$f":"INDEX(Tool!C$14:C$147,MATCH($B8,Tool!$B$14:$B$147,0),1)","v":"Does the sponsoring entity have the capabilities to procure PPPs?"},null,{"$f":"IF(INDEX(Tool!T$14:T$147,MATCH($B8,Tool!$B$14:$B$147,0),1)<>\"\",INDEX(Tool!T$14:T$147,MATCH($B8,Tool!$B$14:$B$147,0),1),\"\")","v":"No capabilities"},{"$f":"IF(INDEX(Tool!U$14:U$147,MATCH($B8,Tool!$B$14:$B$147,0),1)<>\"\",INDEX(Tool!U$14:U$147,MATCH($B8,Tool!$B$14:$B$147,0),1),\"\")","v":"Very little capability"},{"$f":"IF(INDEX(Tool!V$14:V$147,MATCH($B8,Tool!$B$14:$B$147,0),1)<>\"\",INDEX(Tool!V$14:V$147,MATCH($B8,Tool!$B$14:$B$147,0),1),\"\")","v":"Some capabilities"},{"$f":"IF(INDEX(Tool!W$14:W$147,MATCH($B8,Tool!$B$14:$B$147,0),1)<>\"\",INDEX(Tool!W$14:W$147,MATCH($B8,Tool!$B$14:$B$147,0),1),\"\")","v":"Good capability"},{"$f":"IF(INDEX(Tool!X$14:X$147,MATCH($B8,Tool!$B$14:$B$147,0),1)<>\"\",INDEX(Tool!X$14:X$147,MATCH($B8,Tool!$B$14:$B$147,0),1),\"\")","v":"Full set of capabilities"},null,{"$f":"IF(INDEX(Tool!F$14:F$147,MATCH($B8,Tool!$B$14:$B$147,0),1)<>\"\",INDEX(Tool!F$14:F$147,MATCH($B8,Tool!$B$14:$B$147,0),1),\"\")","v":{"v":0.75,"d":"75%"}},""]
[null,{"$f":"MAX(B$6:B8)+1","v":2},{"$f":"INDEX(Tool!C$14:C$147,MATCH($B9,Tool!$B$14:$B$147,0),1)","v":"Does the sponsoring entity have the capabilities to manage and monitor a PPP contract?"},null,{"$f":"IF(INDEX(Tool!T$14:T$147,MATCH($B9,Tool!$B$14:$B$147,0),1)<>\"\",INDEX(Tool!T$14:T$147,MATCH($B9,Tool!$B$14:$B$147,0),1),\"\")","v":"No capabilities"},{"$f":"IF(INDEX(Tool!U$14:U$147,MATCH($B9,Tool!$B$14:$B$147,0),1)<>\"\",INDEX(Tool!U$14:U$147,MATCH($B9,Tool!$B$14:$B$147,0),1),\"\")","v":"Very little capability"},{"$f":"IF(INDEX(Tool!V$14:V$147,MATCH($B9,Tool!$B$14:$B$147,0),1)<>\"\",INDEX(Tool!V$14:V$147,MATCH($B9,Tool!$B$14:$B$147,0),1),\"\")","v":"Some capabilities"},{"$f":"IF(INDEX(Tool!W$14:W$147,MATCH($B9,Tool!$B$14:$B$147,0),1)<>\"\",INDEX(Tool!W$14:W$147,MATCH($B9,Tool!$B$14:$B$147,0),1),\"\")","v":"Good capability"},{"$f":"IF(INDEX(Tool!X$14:X$147,MATCH($B9,Tool!$B$14:$B$147,0),1)<>\"\",INDEX(Tool!X$14:X$147,MATCH($B9,Tool!$B$14:$B$147,0),1),\"\")","v":"Full set of capabilities"},null,{"$f":"IF(INDEX(Tool!F$14:F$147,MATCH($B9,Tool!$B$14:$B$147,0),1)<>\"\",INDEX(Tool!F$14:F$147,MATCH($B9,Tool!$B$14:$B$147,0),1),\"\")","v":{"v":0.75,"d":"75%"}},""]
[null,{"$f":"MAX(B$6:B9)+1","v":3},{"$f":"INDEX(Tool!C$14:C$147,MATCH($B10,Tool!$B$14:$B$147,0),1)","v":"Does the sponsoring entity have previous experience with PPPs?"},null,{"$f":"IF(INDEX(Tool!T$14:T$147,MATCH($B10,Tool!$B$14:$B$147,0),1)<>\"\",INDEX(Tool!T$14:T$147,MATCH($B10,Tool!$B$14:$B$147,0),1),\"\")","v":"No previous PPP experience"},{"$f":"IF(INDEX(Tool!U$14:U$147,MATCH($B10,Tool!$B$14:$B$147,0),1)<>\"\",INDEX(Tool!U$14:U$147,MATCH($B10,Tool!$B$14:$B$147,0),1),\"\")","v":"Some experience with dissimilar PPPs"},{"$f":"IF(INDEX(Tool!V$14:V$147,MATCH($B10,Tool!$B$14:$B$147,0),1)<>\"\",INDEX(Tool!V$14:V$147,MATCH($B10,Tool!$B$14:$B$147,0),1),\"\")","v":"Limited experience (1 project), for a similar PPP"},{"$f":"IF(INDEX(Tool!W$14:W$147,MATCH($B10,Tool!$B$14:$B$147,0),1)<>\"\",INDEX(Tool!W$14:W$147,MATCH($B10,Tool!$B$14:$B$147,0),1),\"\")","v":"Significant experience (2-4 projects), including similar PPPs"},{"$f":"IF(INDEX(Tool!X$14:X$147,MATCH($B10,Tool!$B$14:$B$147,0),1)<>\"\",INDEX(Tool!X$14:X$147,MATCH($B10,Tool!$B$14:$B$147,0),1),\"\")","v":"Extensive experience (5+ projects), including similar PPPs"},null,{"$f":"IF(INDEX(Tool!F$14:F$147,MATCH($B10,Tool!$B$14:$B$147,0),1)<>\"\",INDEX(Tool!F$14:F$147,MATCH($B10,Tool!$B$14:$B$147,0),1),\"\")","v":{"v":0.75,"d":"75%"}},""]
[null,"II",{"$f":"INDEX(Tool!C$14:C$147,MATCH($B11,Tool!$B$14:$B$147,0),1)","v":"Public sector funding"},null,{"$f":"IF(INDEX(Tool!T$14:T$147,MATCH($B11,Tool!$B$14:$B$147,0),1)<>\"\",INDEX(Tool!T$14:T$147,MATCH($B11,Tool!$B$14:$B$147,0),1),\"\")","v":""},{"$f":"IF(INDEX(Tool!U$14:U$147,MATCH($B11,Tool!$B$14:$B$147,0),1)<>\"\",INDEX(Tool!U$14:U$147,MATCH($B11,Tool!$B$14:$B$147,0),1),\"\")","v":""},{"$f":"IF(INDEX(Tool!V$14:V$147,MATCH($B11,Tool!$B$14:$B$147,0),1)<>\"\",INDEX(Tool!V$14:V$147,MATCH($B11,Tool!$B$14:$B$147,0),1),\"\")","v":""},{"$f":"IF(INDEX(Tool!W$14:W$147,MATCH($B11,Tool!$B$14:$B$147,0),1)<>\"\",INDEX(Tool!W$14:W$147,MATCH($B11,Tool!$B$14:$B$147,0),1),\"\")","v":""},{"$f":"IF(INDEX(Tool!X$14:X$147,MATCH($B11,Tool!$B$14:$B$147,0),1)<>\"\",INDEX(Tool!X$14:X$147,MATCH($B11,Tool!$B$14:$B$147,0),1),\"\")","v":""},null,{"$f":"IF(INDEX(Tool!F$14:F$147,MATCH($B11,Tool!$B$14:$B$147,0),1)<>\"\",INDEX(Tool!F$14:F$147,MATCH($B11,Tool!$B$14:$B$147,0),1),\"\")","v":""},""]
[null,{"$f":"MAX(B$6:B11)+1","v":4},{"$f":"INDEX(Tool!C$14:C$147,MATCH($B12,Tool!$B$14:$B$147,0),1)","v":"Is funding assistance available for project preparation?"},null,{"$f":"IF(INDEX(Tool!T$14:T$147,MATCH($B12,Tool!$B$14:$B$147,0),1)<>\"\",INDEX(Tool!T$14:T$147,MATCH($B12,Tool!$B$14:$B$147,0),1),\"\")","v":"Not at all"},{"$f":"IF(INDEX(Tool!U$14:U$147,MATCH($B12,Tool!$B$14:$B$147,0),1)<>\"\",INDEX(Tool!U$14:U$147,MATCH($B12,Tool!$B$14:$B$147,0),1),\"\")","v":"Unlikely"},{"$f":"IF(INDEX(Tool!V$14:V$147,MATCH($B12,Tool!$B$14:$B$147,0),1)<>\"\",INDEX(Tool!V$14:V$147,MATCH($B12,Tool!$B$14:$B$147,0),1),\"\")","v":"Possible"},{"$f":"IF(INDEX(Tool!W$14:W$147,MATCH($B12,Tool!$B$14:$B$147,0),1)<>\"\",INDEX(Tool!W$14:W$147,MATCH($B12,Tool!$B$14:$B$147,0),1),\"\")","v":"Likely"},{"$f":"IF(INDEX(Tool!X$14:X$147,MATCH($B12,Tool!$B$14:$B$147,0),1)<>\"\",INDEX(Tool!X$14:X$147,MATCH($B12,Tool!$B$14:$B$147,0),1),\"\")","v":"Guaranteed"},null,{"$f":"IF(INDEX(Tool!F$14:F$147,MATCH($B12,Tool!$B$14:$B$147,0),1)<>\"\",INDEX(Tool!F$14:F$147,MATCH($B12,Tool!$B$14:$B$147,0),1),\"\")","v":{"v":0.25,"d":"25%"}},""]
[null,{"$f":"MAX(B$6:B12)+1","v":5},{"$f":"INDEX(Tool!C$14:C$147,MATCH($B13,Tool!$B$14:$B$147,0),1)","v":"Is viability gap funding available for the PPP project?"},null,{"$f":"IF(INDEX(Tool!T$14:T$147,MATCH($B13,Tool!$B$14:$B$147,0),1)<>\"\",INDEX(Tool!T$14:T$147,MATCH($B13,Tool!$B$14:$B$147,0),1),\"\")","v":"Not at all"},{"$f":"IF(INDEX(Tool!U$14:U$147,MATCH($B13,Tool!$B$14:$B$147,0),1)<>\"\",INDEX(Tool!U$14:U$147,MATCH($B13,Tool!$B$14:$B$147,0),1),\"\")","v":"Unlikely"},{"$f":"IF(INDEX(Tool!V$14:V$147,MATCH($B13,Tool!$B$14:$B$147,0),1)<>\"\",INDEX(Tool!V$14:V$147,MATCH($B13,Tool!$B$14:$B$147,0),1),\"\")","v":"Possible"},{"$f":"IF(INDEX(Tool!W$14:W$147,MATCH($B13,Tool!$B$14:$B$147,0),1)<>\"\",INDEX(Tool!W$14:W$147,MATCH($B13,Tool!$B$14:$B$147,0),1),\"\")","v":"Likely"},{"$f":"IF(INDEX(Tool!X$14:X$147,MATCH($B13,Tool!$B$14:$B$147,0),1)<>\"\",INDEX(Tool!X$14:X$147,MATCH($B13,Tool!$B$14:$B$147,0),1),\"\")","v":"Guaranteed"},null,{"$f":"IF(INDEX(Tool!F$14:F$147,MATCH($B13,Tool!$B$14:$B$147,0),1)<>\"\",INDEX(Tool!F$14:F$147,MATCH($B13,Tool!$B$14:$B$147,0),1),\"\")","v":{"v":0.75,"d":"75%"}},""]
[null,{"$f":"MAX(B$6:B13)+1","v":6},{"$f":"INDEX(Tool!C$14:C$147,MATCH($B14,Tool!$B$14:$B$147,0),1)","v":"Is the PPP project eligible for significant funding from other sources?"},null,{"$f":"IF(INDEX(Tool!T$14:T$147,MATCH($B14,Tool!$B$14:$B$147,0),1)<>\"\",INDEX(Tool!T$14:T$147,MATCH($B14,Tool!$B$14:$B$147,0),1),\"\")","v":"Not at all"},{"$f":"IF(INDEX(Tool!U$14:U$147,MATCH($B14,Tool!$B$14:$B$147,0),1)<>\"\",INDEX(Tool!U$14:U$147,MATCH($B14,Tool!$B$14:$B$147,0),1),\"\")","v":"Unlikely"},{"$f":"IF(INDEX(Tool!V$14:V$147,MATCH($B14,Tool!$B$14:$B$147,0),1)<>\"\",INDEX(Tool!V$14:V$147,MATCH($B14,Tool!$B$14:$B$147,0),1),\"\")","v":"Possible"},{"$f":"IF(INDEX(Tool!W$14:W$147,MATCH($B14,Tool!$B$14:$B$147,0),1)<>\"\",INDEX(Tool!W$14:W$147,MATCH($B14,Tool!$B$14:$B$147,0),1),\"\")","v":"Likely"},{"$f":"IF(INDEX(Tool!X$14:X$147,MATCH($B14,Tool!$B$14:$B$147,0),1)<>\"\",INDEX(Tool!X$14:X$147,MATCH($B14,Tool!$B$14:$B$147,0),1),\"\")","v":"Guaranteed"},null,{"$f":"IF(INDEX(Tool!F$14:F$147,MATCH($B14,Tool!$B$14:$B$147,0),1)<>\"\",INDEX(Tool!F$14:F$147,MATCH($B14,Tool!$B$14:$B$147,0),1),\"\")","v":{"v":0.5,"d":"50%"}},""]
[null,"III",{"$f":"INDEX(Tool!C$14:C$147,MATCH($B15,Tool!$B$14:$B$147,0),1)","v":"Private sector capability and appetite"},null,{"$f":"IF(INDEX(Tool!T$14:T$147,MATCH($B15,Tool!$B$14:$B$147,0),1)<>\"\",INDEX(Tool!T$14:T$147,MATCH($B15,Tool!$B$14:$B$147,0),1),\"\")","v":""},{"$f":"IF(INDEX(Tool!U$14:U$147,MATCH($B15,Tool!$B$14:$B$147,0),1)<>\"\",INDEX(Tool!U$14:U$147,MATCH($B15,Tool!$B$14:$B$147,0),1),\"\")","v":""},{"$f":"IF(INDEX(Tool!V$14:V$147,MATCH($B15,Tool!$B$14:$B$147,0),1)<>\"\",INDEX(Tool!V$14:V$147,MATCH($B15,Tool!$B$14:$B$147,0),1),\"\")","v":""},{"$f":"IF(INDEX(Tool!W$14:W$147,MATCH($B15,Tool!$B$14:$B$147,0),1)<>\"\",INDEX(Tool!W$14:W$147,MATCH($B15,Tool!$B$14:$B$147,0),1),\"\")","v":""},{"$f":"IF(INDEX(Tool!X$14:X$147,MATCH($B15,Tool!$B$14:$B$147,0),1)<>\"\",INDEX(Tool!X$14:X$147,MATCH($B15,Tool!$B$14:$B$147,0),1),\"\")","v":""},null,{"$f":"IF(INDEX(Tool!F$14:F$147,MATCH($B15,Tool!$B$14:$B$147,0),1)<>\"\",INDEX(Tool!F$14:F$147,MATCH($B15,Tool!$B$14:$B$147,0),1),\"\")","v":""},""]
[null,{"$f":"MAX(B$6:B15)+1","v":7},{"$f":"INDEX(Tool!C$14:C$147,MATCH($B16,Tool!$B$14:$B$147,0),1)","v":"Are multiple firms active in the project sector and likely to be interested?"},null,{"$f":"IF(INDEX(Tool!T$14:T$147,MATCH($B16,Tool!$B$14:$B$147,0),1)<>\"\",INDEX(Tool!T$14:T$147,MATCH($B16,Tool!$B$14:$B$147,0),1),\"\")","v":"No interest expected"},{"$f":"IF(INDEX(Tool!U$14:U$147,MATCH($B16,Tool!$B$14:$B$147,0),1)<>\"\",INDEX(Tool!U$14:U$147,MATCH($B16,Tool!$B$14:$B$147,0),1),\"\")","v":"Extent of interest among qualified firms is not yet known"},{"$f":"IF(INDEX(Tool!V$14:V$147,MATCH($B16,Tool!$B$14:$B$147,0),1)<>\"\",INDEX(Tool!V$14:V$147,MATCH($B16,Tool!$B$14:$B$147,0),1),\"\")","v":"Some interest expected"},{"$f":"IF(INDEX(Tool!W$14:W$147,MATCH($B16,Tool!$B$14:$B$147,0),1)<>\"\",INDEX(Tool!W$14:W$147,MATCH($B16,Tool!$B$14:$B$147,0),1),\"\")","v":"5+ qualified firms are expected to be interested"},{"$f":"IF(INDEX(Tool!X$14:X$147,MATCH($B16,Tool!$B$14:$B$147,0),1)<>\"\",INDEX(Tool!X$14:X$147,MATCH($B16,Tool!$B$14:$B$147,0),1),\"\")","v":"5+ qualified firms have competed for similar opportunities"},null,{"$f":"IF(INDEX(Tool!F$14:F$147,MATCH($B16,Tool!$B$14:$B$147,0),1)<>\"\",INDEX(Tool!F$14:F$147,MATCH($B16,Tool!$B$14:$B$147,0),1),\"\")","v":{"v":1,"d":"100%"}},""]
[null,{"$f":"MAX(B$6:B16)+1","v":8},{"$f":"INDEX(Tool!C$14:C$147,MATCH($B17,Tool!$B$14:$B$147,0),1)","v":"Have similar PPP projects been successfully financed in Afghanistan?"},null,{"$f":"IF(INDEX(Tool!T$14:T$147,MATCH($B17,Tool!$B$14:$B$147,0),1)<>\"\",INDEX(Tool!T$14:T$147,MATCH($B17,Tool!$B$14:$B$147,0),1),\"\")","v":"No PPP projects recently financed"},{"$f":"IF(INDEX(Tool!U$14:U$147,MATCH($B17,Tool!$B$14:$B$147,0),1)<>\"\",INDEX(Tool!U$14:U$147,MATCH($B17,Tool!$B$14:$B$147,0),1),\"\")","v":"No similar PPP projects recently financed"},{"$f":"IF(INDEX(Tool!V$14:V$147,MATCH($B17,Tool!$B$14:$B$147,0),1)<>\"\",INDEX(Tool!V$14:V$147,MATCH($B17,Tool!$B$14:$B$147,0),1),\"\")","v":"Dissimilar PPP projects financed in last 2 years"},{"$f":"IF(INDEX(Tool!W$14:W$147,MATCH($B17,Tool!$B$14:$B$147,0),1)<>\"\",INDEX(Tool!W$14:W$147,MATCH($B17,Tool!$B$14:$B$147,0),1),\"\")","v":"At least one similar PPP project successfully financed in last 2 years"},{"$f":"IF(INDEX(Tool!X$14:X$147,MATCH($B17,Tool!$B$14:$B$147,0),1)<>\"\",INDEX(Tool!X$14:X$147,MATCH($B17,Tool!$B$14:$B$147,0),1),\"\")","v":"Multiple similar PPP projects successfully financed in last 2 years"},null,{"$f":"IF(INDEX(Tool!F$14:F$147,MATCH($B17,Tool!$B$14:$B$147,0),1)<>\"\",INDEX(Tool!F$14:F$147,MATCH($B17,Tool!$B$14:$B$147,0),1),\"\")","v":{"v":1,"d":"100%"}},{"$f":"IF(J17<>\"\",K17*J17,\"\")","v":""}]
[null,{"$f":"MAX(B$6:B17)+1","v":9},{"$f":"INDEX(Tool!C$14:C$147,MATCH($B18,Tool!$B$14:$B$147,0),1)","v":"Have similar PPP projects been successfully financed in countries similar to Afghanistan?"},null,{"$f":"IF(INDEX(Tool!T$14:T$147,MATCH($B18,Tool!$B$14:$B$147,0),1)<>\"\",INDEX(Tool!T$14:T$147,MATCH($B18,Tool!$B$14:$B$147,0),1),\"\")","v":"No PPP projects recently financed"},{"$f":"IF(INDEX(Tool!U$14:U$147,MATCH($B18,Tool!$B$14:$B$147,0),1)<>\"\",INDEX(Tool!U$14:U$147,MATCH($B18,Tool!$B$14:$B$147,0),1),\"\")","v":"No similar PPP projects recently financed"},{"$f":"IF(INDEX(Tool!V$14:V$147,MATCH($B18,Tool!$B$14:$B$147,0),1)<>\"\",INDEX(Tool!V$14:V$147,MATCH($B18,Tool!$B$14:$B$147,0),1),\"\")","v":"Somewhat similar PPP projects financed in last 2 years"},{"$f":"IF(INDEX(Tool!W$14:W$147,MATCH($B18,Tool!$B$14:$B$147,0),1)<>\"\",INDEX(Tool!W$14:W$147,MATCH($B18,Tool!$B$14:$B$147,0),1),\"\")","v":"At least one very similar PPP project successfully financed in last 2 years"},{"$f":"IF(INDEX(Tool!X$14:X$147,MATCH($B18,Tool!$B$14:$B$147,0),1)<>\"\",INDEX(Tool!X$14:X$147,MATCH($B18,Tool!$B$14:$B$147,0),1),\"\")","v":"Multiple very similar PPP projects successfully financed in last 2 years"},null,{"$f":"IF(INDEX(Tool!F$14:F$147,MATCH($B18,Tool!$B$14:$B$147,0),1)<>\"\",INDEX(Tool!F$14:F$147,MATCH($B18,Tool!$B$14:$B$147,0),1),\"\")","v":{"v":0.75,"d":"75%"}},""]
[null,"B",{"$f":"INDEX(Tool!C$14:C$147,MATCH($B19,Tool!$B$14:$B$147,0),1)","v":"How suitable is the project for PPP?"},null,{"$f":"IF(INDEX(Tool!T$14:T$147,MATCH($B19,Tool!$B$14:$B$147,0),1)<>\"\",INDEX(Tool!T$14:T$147,MATCH($B19,Tool!$B$14:$B$147,0),1),\"\")","v":""},{"$f":"IF(INDEX(Tool!U$14:U$147,MATCH($B19,Tool!$B$14:$B$147,0),1)<>\"\",INDEX(Tool!U$14:U$147,MATCH($B19,Tool!$B$14:$B$147,0),1),\"\")","v":""},{"$f":"IF(INDEX(Tool!V$14:V$147,MATCH($B19,Tool!$B$14:$B$147,0),1)<>\"\",INDEX(Tool!V$14:V$147,MATCH($B19,Tool!$B$14:$B$147,0),1),\"\")","v":""},{"$f":"IF(INDEX(Tool!W$14:W$147,MATCH($B19,Tool!$B$14:$B$147,0),1)<>\"\",INDEX(Tool!W$14:W$147,MATCH($B19,Tool!$B$14:$B$147,0),1),\"\")","v":""},{"$f":"IF(INDEX(Tool!X$14:X$147,MATCH($B19,Tool!$B$14:$B$147,0),1)<>\"\",INDEX(Tool!X$14:X$147,MATCH($B19,Tool!$B$14:$B$147,0),1),\"\")","v":""},null,{"$f":"IF(INDEX(Tool!F$14:F$147,MATCH($B19,Tool!$B$14:$B$147,0),1)<>\"\",INDEX(Tool!F$14:F$147,MATCH($B19,Tool!$B$14:$B$147,0),1),\"\")","v":""},""]
[null,"IV",{"$f":"INDEX(Tool!C$14:C$147,MATCH($B20,Tool!$B$14:$B$147,0),1)","v":"Key project characteristics"},null,{"$f":"IF(INDEX(Tool!T$14:T$147,MATCH($B20,Tool!$B$14:$B$147,0),1)<>\"\",INDEX(Tool!T$14:T$147,MATCH($B20,Tool!$B$14:$B$147,0),1),\"\")","v":""},{"$f":"IF(INDEX(Tool!U$14:U$147,MATCH($B20,Tool!$B$14:$B$147,0),1)<>\"\",INDEX(Tool!U$14:U$147,MATCH($B20,Tool!$B$14:$B$147,0),1),\"\")","v":""},{"$f":"IF(INDEX(Tool!V$14:V$147,MATCH($B20,Tool!$B$14:$B$147,0),1)<>\"\",INDEX(Tool!V$14:V$147,MATCH($B20,Tool!$B$14:$B$147,0),1),\"\")","v":""},{"$f":"IF(INDEX(Tool!W$14:W$147,MATCH($B20,Tool!$B$14:$B$147,0),1)<>\"\",INDEX(Tool!W$14:W$147,MATCH($B20,Tool!$B$14:$B$147,0),1),\"\")","v":""},{"$f":"IF(INDEX(Tool!X$14:X$147,MATCH($B20,Tool!$B$14:$B$147,0),1)<>\"\",INDEX(Tool!X$14:X$147,MATCH($B20,Tool!$B$14:$B$147,0),1),\"\")","v":""},null,{"$f":"IF(INDEX(Tool!F$14:F$147,MATCH($B20,Tool!$B$14:$B$147,0),1)<>\"\",INDEX(Tool!F$14:F$147,MATCH($B20,Tool!$B$14:$B$147,0),1),\"\")","v":""},""]
{"$rows_left_out":50}